{"text_format":"1","workbook":"xlsx","n_sheets":5,"sheets":["FL Cover Sheet","Value Reconciliation","Data Entry-Inventory Worksheet","Tables","Price Tbl-2026 SalesComp"],"not_rendered":{"charts":0,"images":0,"macros":1,"external_links":2,"defined_names":7,"comments":2,"pivot_tables":0},"unopened":[],"bounds":{"document_bytes":16777216,"sheet_cells":100000,"rows_first":2000,"rows_last":500,"rows_between":2000,"halvings":0,"cell_chars":16384,"cell_head_chars":4096},"cells_cut":0,"cells_raw":0,"read":"whole","date_system":"1900"}

{"sheet":"FL Cover Sheet","index":0,"n_rows":143,"n_cols":6,"rows_kept":143,"cut":false,"hidden":false,"merged":[[21,0,21,3],[27,0,27,3],[22,2,23,2],[22,3,23,3],[15,5,15,12],[1,0,1,3],[2,0,2,3],[2,5,3,9],[4,5,5,9],[7,5,9,12],[9,0,9,3],[10,5,10,12],[11,5,11,12],[12,5,12,12],[14,5,14,12],[17,5,17,12],[13,5,13,12],[16,5,16,12]]}
["County",null,"Appraisal Year ",2026]
[]
[null,null,null,null,null,"LIGHT YELLOW SHADED FIELDS ARE FOR USER INPUT THROUGHOUT THIS TEMPLATE"]
["Facility Name"]
["Company/Owner Name",null,null,null,null,"Other colors and non-shaded fields should remain locked to function properly. They contain data and calculations that will populate automatically based on user input into yellow fields. "]
["Situs Address",null,"Situs Zip"]
["Facility Contact"]
["Phone # ",null,null,null,null,"USING TEMPLATE"]
[]
[]
{"$rows_left_out":134}
{"sheet":"Value Reconciliation","index":1,"n_rows":34,"n_cols":8,"rows_kept":34,"cut":false,"hidden":false,"merged":[[12,7,13,12],[12,0,12,2],[12,3,12,4],[12,5,12,6],[26,0,26,3],[16,5,16,6],[17,5,17,6],[21,4,21,6],[21,0,21,3],[18,0,18,6],[16,0,16,4],[17,0,17,4],[19,0,19,1],[20,0,20,6],[9,5,9,6],[13,0,13,1],[15,3,15,4],[9,0,9,2],[9,3,9,4],[10,0,10,2],[10,3,10,4],[14,0,14,6],[15,5,15,6],[10,5,10,6],[15,0,15,2],[6,5,6,6],[7,5,7,6],[8,5,8,6],[6,0,6,2],[7,0,7,2],[8,0,8,2],[6,3,6,4],[7,3,7,4],[8,3,8,4],[0,3,0,4],[3,0,3,1],[4,5,4,6],[5,5,5,6],[4,3,4,4],[4,0,4,2],[5,0,5,2],[5,3,5,4],[1,5,1,6],[31,0,31,3],[31,4,31,6],[33,0,36,6],[22,0,22,6],[24,0,24,2],[25,0,25,4],[23,3,23,4],[24,3,24,4],[24,5,24,6],[25,5,25,6],[27,0,27,6],[29,0,29,3],[29,4,29,6],[30,0,30,3],[30,4,30,6],[26,4,26,6]]}
["Quick Ref ID#",{"$f":"IF('FL Cover Sheet'!D11=\"\",\"\",'FL Cover Sheet'!D11)","v":""},"Owner",{"$f":"IF('FL Cover Sheet'!B5=\"\",\"\",'FL Cover Sheet'!B5)","v":""},null,"Tax Year",{"$f":"'FL Cover Sheet'!D1","v":2026}]
["Situs",{"$f":"IF('FL Cover Sheet'!B6=\"\",\"\",'FL Cover Sheet'!B6)","v":""},"Situs ZIP",{"$f":"IF('FL Cover Sheet'!D6=\"\",\"\",'FL Cover Sheet'!D6)","v":""},"Region",{"$f":"IF('FL Cover Sheet'!B23=\"\",\"\",'FL Cover Sheet'!B23)","v":""}]
[]
["Feedlot Quality and Condition Summary"]
[null,null,null,"Quality",null,"Condition"]
["Feedlot Improvements",null,null,{"$f":"IFERROR(_xlfn.IFNA(VLOOKUP(IF('Data Entry-Inventory Worksheet'!L30<1,Tables!$S$129,ROUND('Data Entry-Inventory Worksheet'!L30,0)),Tables!$S$125:$T$129,2,FALSE),\"\"),\"\")","v":""},null,{"$f":"IFERROR(_xlfn.IFNA(VLOOKUP(MROUND('Data Entry-Inventory Worksheet'!N30,0.5),Tables!$L$29:$M$37,2,FALSE),\"\"),\"\")","v":""}]
["Cattle Pens",null,null,{"$f":"IFERROR(_xlfn.IFNA(VLOOKUP(IF('Data Entry-Inventory Worksheet'!L44<1,Tables!$S$129,ROUND('Data Entry-Inventory Worksheet'!L44,0)),Tables!$S$125:$T$129,2,FALSE),\"\"),\"\")","v":""},null,{"$f":"IFERROR(_xlfn.IFNA(VLOOKUP(MROUND('Data Entry-Inventory Worksheet'!N44,0.5),Tables!$L$29:$M$37,2,FALSE),\"\"),\"\")","v":""}]
["Feed Storage Type",null,null,{"$f":"IFERROR(_xlfn.IFNA(VLOOKUP(IF('Data Entry-Inventory Worksheet'!L58<1,Tables!$S$129,ROUND('Data Entry-Inventory Worksheet'!L58,0)),Tables!$S$125:$T$129,2,FALSE),\"\"),\"\")","v":""},null,{"$f":"IFERROR(_xlfn.IFNA(VLOOKUP(MROUND('Data Entry-Inventory Worksheet'!N58,0.5),Tables!$L$29:$M$37,2,FALSE),\"\"),\"\")","v":""}]
["Feed Processing Type",null,null,{"$f":"IFERROR(_xlfn.IFNA(VLOOKUP(IF('Data Entry-Inventory Worksheet'!L67<1,Tables!$S$129,ROUND('Data Entry-Inventory Worksheet'!L67,0)),Tables!$S$125:$T$129,2,FALSE),\"\"),\"\")","v":""},null,{"$f":"IFERROR(_xlfn.IFNA(VLOOKUP(MROUND('Data Entry-Inventory Worksheet'!N67,0.5),Tables!$L$29:$M$37,2,FALSE),\"\"),\"\")","v":""}]
["Quality & Condition Overall Feedlot ",null,null,{"$f":"'Data Entry-Inventory Worksheet'!L72","v":""},null,{"$f":"'Data Entry-Inventory Worksheet'!N72","v":""}]
{"$rows_left_out":25}
{"sheet":"Data Entry-Inventory Worksheet","index":2,"n_rows":86,"n_cols":26,"rows_kept":86,"cut":false,"hidden":false,"merged":[[1,5,1,6],[73,9,73,13],[81,9,81,13],[74,7,85,8],[7,4,7,5],[17,3,17,9],[17,10,17,13],[65,3,65,4],[70,9,71,9],[68,0,72,7],[61,3,61,4],[62,3,62,4],[63,3,63,4],[64,3,64,4],[65,0,65,2],[61,0,61,2],[63,0,63,2],[38,1,38,2],[39,1,39,2],[55,1,55,2],[56,1,56,2],[50,1,50,2],[51,1,51,2],[53,1,53,2],[54,1,54,2],[52,1,52,2],[64,0,64,2],[62,0,62,2],[67,0,67,7],[8,4,8,5],[9,4,9,5],[15,5,15,7],[16,5,16,7],[11,4,11,5],[12,4,12,5],[13,4,13,5],[10,4,10,6],[14,4,14,7],[23,1,23,2],[24,1,24,2],[25,1,25,2],[26,1,26,2],[60,3,60,4],[60,0,60,2],[41,1,41,2],[42,1,42,2],[40,1,40,2],[46,1,46,2],[47,1,47,2],[48,1,48,2],[49,1,49,2],[16,1,16,2],[15,1,15,2],[44,10,44,11],[36,1,36,2],[37,1,37,2],[18,1,18,2],[19,1,19,2],[27,1,27,2],[28,1,28,2],[32,1,32,2],[33,1,33,2],[34,1,34,2],[35,1,35,2],[20,1,20,2],[21,1,21,2],[22,1,22,2],[7,1,7,2],[8,1,8,2],[9,1,9,2],[14,1,14,2],[0,3,0,4],[3,0,3,6],[4,1,4,2],[5,1,5,2],[6,1,6,2],[4,4,4,6],[5,4,5,5],[6,4,6,5],[10,1,10,2],[11,1,11,2],[12,1,12,2],[13,1,13,2]]}
["Quick Ref ID#",{"$f":"IF('FL Cover Sheet'!D11=\"\",\"\",'FL Cover Sheet'!D11)","v":""},"Owner",{"$f":"IF('FL Cover Sheet'!B5=\"\",\"\",'FL Cover Sheet'!B5)","v":""},null,"Tax Year",{"$f":"'FL Cover Sheet'!D1","v":2026},null,null,null,null,null,null,null,null,null,null,null,null,null,null,null," Improvements","Cattle Pens","Feed Storage","Feed Process"]
["Situs",{"$f":"IF('FL Cover Sheet'!B6=\"\",\"\",'FL Cover Sheet'!B6)","v":""},"Situs ZIP",{"$f":"IF('FL Cover Sheet'!D6=\"\",\"\",'FL Cover Sheet'!D6)","v":""},"Region",{"$f":"IF('FL Cover Sheet'!B23=\"\",\"\",'FL Cover Sheet'!B23)","v":""},null,null,null,null,null,null,null,null,null,null,null,null,null,null,null,null,{"$f":"MATCH(W1,$J:$J,0)","v":30},{"$f":"MATCH(X1,$J:$J,0)","v":44},58,67]
[]
["Commercial Feedlot Real Estate Inventory"]
["Quick Ref","Parcel Number ",null,"Feedlot Acres per Parcel","Feedlot Capacity"]
[{"$f":"IF('FL Cover Sheet'!D11=\"\",\"\",'FL Cover Sheet'!D11)","v":""},{"$f":"IF('FL Cover Sheet'!B11=\"\",\"\",'FL Cover Sheet'!B11)","v":""},null,null,"Licensed Capacity ",null,{"$f":"IF('FL Cover Sheet'!B25=\"\",\"\",'FL Cover Sheet'!B25)","v":""}]
[{"$f":"IF('FL Cover Sheet'!D12=\"\",\"\",'FL Cover Sheet'!D12)","v":""},{"$f":"IF('FL Cover Sheet'!B12=\"\",\"\",'FL Cover Sheet'!B12)","v":""},null,null,"Inches per Head",null,12]
[{"$f":"IF('FL Cover Sheet'!D13=\"\",\"\",'FL Cover Sheet'!D13)","v":""},{"$f":"IF('FL Cover Sheet'!B13=\"\",\"\",'FL Cover Sheet'!B13)","v":""},null,null,"Reported Bunk Capacity",null,{"$f":"IF('FL Cover Sheet'!$B$26=\"\",\"\",'FL Cover Sheet'!B26)","v":""}]
[{"$f":"IF('FL Cover Sheet'!D14=\"\",\"\",'FL Cover Sheet'!D14)","v":""},{"$f":"IF('FL Cover Sheet'!B14=\"\",\"\",'FL Cover Sheet'!B14)","v":""},null,null,"Bunk Linear Feet",null,{"$f":"IF('FL Cover Sheet'!$D$26=\"\",\"\",'FL Cover Sheet'!D26)","v":""}]
[{"$f":"IF('FL Cover Sheet'!D15=\"\",\"\",'FL Cover Sheet'!D15)","v":""},{"$f":"IF('FL Cover Sheet'!B15=\"\",\"\",'FL Cover Sheet'!B15)","v":""},null,null,"Reported OR Calculated Bunk Capacity",null,{"$f":"IFERROR(IF(G8=\"\",ROUND(G9*12/G7,0),G8),\"\")","v":""}]
{"$rows_left_out":77}
{"sheet":"Tables","index":3,"n_rows":129,"n_cols":101,"rows_kept":129,"cut":false,"hidden":false,"merged":[[0,0,0,13],[1,0,1,3],[0,42,0,51],[1,43,1,51],[0,54,0,63],[1,5,1,8],[1,10,1,13],[0,66,0,75],[0,78,0,87],[20,54,20,55],[20,57,20,58],[0,90,0,99],[1,55,1,63],[1,67,1,75],[1,79,1,87],[1,91,1,99],[23,23,23,25],[23,26,23,28],[21,0,21,1],[8,19,8,40],[23,32,23,35],[11,32,11,33],[11,20,11,21],[11,23,11,24],[11,26,11,27],[11,29,11,30],[10,0,10,8],[35,1,35,2],[12,1,12,3],[12,6,12,8],[121,17,121,19],[122,17,122,19],[27,10,27,11],[34,1,34,2],[2,1,2,3],[2,6,2,8],[2,11,2,13],[11,0,11,3],[11,5,11,8],[11,10,11,11]]}
["Variations of Steam Flake Mill Facilities",null,null,null,null,null,null,null,null,null,null,null,null,null,null,null,null,null,null,null,null,null,null,null,null,null,null,null,null,null,null,null,null,null,null,null,null,null,null,null,null,null,"Weigh and Mix/Full Batch in Mill",null,null,null,null,null,null,null,null,null,null,null,"Weigh System in Mill, Mix Batch in Feed Truck/Stationary Mixer",null,null,null,null,null,null,null,null,null,null,null,"Bunker System-Weight and Mix Batch in Feed-Truck/Stationary Mixer",null,null,null,null,null,null,null,null,null,null,null,"Dry Roll Mill Facility",null,null,null,null,null,null,null,null,null,null,null,"Minimum Feed Processing Facility"]
["Weigh and Mix/Full Batch in Mill",null,null,null,null,"Weigh System in Mill, Mix Batch in Feed Truck/Stationary Mixer",null,null,null,null,"Bunker System—Weigh and Mix Batch in Feed-Truck/Stationary Mixer",null,null,null,null,null,null,null,null,null,null,null,null,null,null,null,null,null,null,null,null,null,null,null,null,null,null,null,null,null,null,null,null,"Condition",null,null,null,null,null,null,null,null,null,null,null,"Condition",null,null,null,null,null,null,null,null,null,null,null,"Condition",null,null,null,null,null,null,null,null,null,null,null,"Condition",null,null,null,null,null,null,null,null,null,null,null,"Condition"]
[null,"Condition",null,null,null,null,"Condition",null,null,null,null,"Condition",null,null,null,null,null,null,null,null,null,null,null,null,null,null,null,null,null,null,null,null,null,null,null,null,null,null,null,null,null,null,"Quality","Poor -","Poor","Fair -","Fair","Average -","Average","Average +","Good","Very Good","Interval",null,"Quality","Poor -","Poor","Fair -","Fair","Average -","Average","Average +","Good","Very Good","Interval",null,"Quality","Poor -","Poor","Fair -","Fair","Average -","Average","Average +","Good","Very Good","Interval",null,"Quality","Poor -","Poor","Fair -","Fair","Average -","Average","Average +","Good","Very Good","Interval",null,"Quality","Poor -","Poor","Fair -","Fair","Average -","Average","Average +","Good","Very Good","Interval"]
["Quality","Poor -","Very Good","Midpt",null,"Quality","Poor -","Very Good","Midpt",null,"Quality","Poor -","Very Good","Midpt",null,null,null,null,null,null,null,null,null,null,null,null,null,null,null,null,null,null,null,null,null,null,null,null,null,null,null,null,"Very Good",140,{"$f":"$AS$18*$BA4+AR4","v":145},{"$f":"$AS$18*$BA4+AS4","v":150},155,160,165,170,175,180,{"$f":"(AZ4-AR4)/8","v":5},null,"Very Good",130,{"$f":"$BE$18*$BM4+BD4","v":135},140,145,150,155,160,165,170,{"$f":"(BL4-BD4)/8","v":5},null,"Very Good",125,{"$f":"$BQ$18*$BY4+BP4","v":130},135,140,145,150,155,160,165,{"$f":"(BX4-BP4)/8","v":5},null,"Very Good",115,{"$f":"$CC$18*$CK4+CB4","v":121.25},127.5,133.75,140,146.25,152.5,158.75,165,{"$f":"(CJ4-CB4)/8","v":6.25},null,"Very Good",60,{"$f":"$CO$18*$CW4+CN4","v":63.75},67.5,71.25,75,78.75,82.5,86.25,90,{"$f":"(CV4-CN4)/8","v":3.75}]
["Very Good",140,180,160,null,"Very Good",130,170,150,null,"Very Good",125,165,145,null,null,null,null,null,null,null,null,null,null,null,null,null,null,null,null,null,null,null,null,null,null,null,null,null,null,null,null,"Very Good -",{"$f":"(AR4-AR7)/3*2+AR7","v":126.66666666666667},{"$f":"$AS$18*$BA5+AR5","v":131.25},135.83333333333334,140.41666666666669,145.00000000000003,149.58333333333337,154.16666666666671,158.75000000000006,{"$f":"(AZ4-AZ7)/3*2+AZ7","v":163.33333333333334},{"$f":"(AZ5-AR5)/8","v":4.5833333333333339},null,"Very Good -",{"$f":"(BD4-BD7)/3*2+BD7","v":118.33333333333333},123.125,127.91666666666667,132.70833333333334,137.5,142.29166666666666,147.08333333333331,151.87499999999997,{"$f":"(BL4-BL7)/3*2+BL7","v":156.66666666666666},4.7916666666666661,null,"Very Good -",{"$f":"(BP4-BP7)/3*2+BP7","v":115},119.58333333333333,124.16666666666666,128.75,133.33333333333334,137.91666666666669,142.50000000000003,147.08333333333337,{"$f":"(BX4-BX7)/3*2+BX7","v":151.66666666666666},4.5833333333333321,null,"Very Good -",{"$f":"(CB4-CB7)/3*2+CB7","v":103.33333333333333},108.95833333333333,114.58333333333333,120.20833333333333,125.83333333333333,131.45833333333334,137.08333333333334,142.70833333333334,{"$f":"(CJ4-CJ7)/3*2+CJ7","v":148.33333333333334},5.6250000000000018,null,"Very Good -",{"$f":"(CN4-CN7)/3*2+CN7","v":53.333333333333336},56.666666666666671,60.000000000000007,63.333333333333343,66.666666666666671,70,73.333333333333329,76.666666666666657,{"$f":"(CV4-CV7)/3*2+CV7","v":80},3.333333333333333]
["Good",100,130,115,null,"Good",95,130,115,null,"Good",95,125,110,null,null,null,null,null,null,null,null,null,null,null,null,null,null,null,null,null,null,null,null,null,null,null,null,null,null,null,null,"Good +",{"$f":"(AR4-AR7)/3*1+AR7","v":113.33333333333333},117.5,121.66666666666667,125.83333333333334,130,134.16666666666666,138.33333333333331,142.49999999999997,{"$f":"(AZ4-AZ7)/3*1+AZ7","v":146.66666666666666},4.1666666666666661,null,"Good +",{"$f":"(BD4-BD7)/3*1+BD7","v":106.66666666666667},111.25,115.83333333333333,120.41666666666666,124.99999999999999,129.58333333333331,134.16666666666666,138.75,{"$f":"(BL4-BL7)/3*1+BL7","v":143.33333333333334},4.5833333333333339,null,"Good +",{"$f":"(BP4-BP7)/3*1+BP7","v":105},109.16666666666667,113.33333333333334,117.50000000000001,121.66666666666669,125.83333333333336,130.00000000000003,134.16666666666669,{"$f":"(BX4-BX7)/3*1+BX7","v":138.33333333333334},4.1666666666666679,null,"Good +",{"$f":"(CB4-CB7)/3*1+CB7","v":91.666666666666671},96.666666666666671,101.66666666666667,106.66666666666667,111.66666666666667,116.66666666666667,121.66666666666667,126.66666666666667,{"$f":"(CJ4-CJ7)/3*1+CJ7","v":131.66666666666666},4.9999999999999982,null,"Good +",{"$f":"(CN4-CN7)/3*1+CN7","v":46.666666666666664},49.583333333333329,52.499999999999993,55.416666666666657,58.333333333333321,61.249999999999986,64.166666666666657,67.083333333333329,{"$f":"(CV4-CV7)/3*1+CV7","v":70},2.916666666666667]
["Average",75,90,85,null,"Average",75,95,85,null,"Average",70,90,80,null,null,null,null,null,null,null,null,null,null,null,null,null,null,null,null,null,null,null,null,null,null,null,null,null,null,null,null,"Good ",100,103.75,107.5,111.25,115,118.75,122.5,126.25,130,3.75,null,"Good ",95,{"$f":"$BE$18*$BM7+BD7","v":99.375},{"$f":"$BE$18*$BM7+BE7","v":103.75},108.125,112.5,116.875,121.25,125.625,130,{"$f":"(BL7-BD7)/8","v":4.375},null,"Good ",95,{"$f":"$BQ$18*$BY7+BP7","v":98.75},{"$f":"$BQ$18*$BY7+BQ7","v":102.5},106.25,110,113.75,117.5,121.25,125,{"$f":"(BX7-BP7)/8","v":3.75},null,"Good ",80,{"$f":"$CC$18*$CK7+CB7","v":84.375},{"$f":"$CC$18*$CK7+CC7","v":88.75},93.125,97.5,101.875,106.25,110.625,115,{"$f":"(CJ7-CB7)/8","v":4.375},null,"Good ",40,{"$f":"$CO$18*$CW7+CN7","v":42.5},{"$f":"$CO$18*$CW7+CO7","v":45},47.5,50,52.5,55,57.5,60,{"$f":"(CV7-CN7)/8","v":2.5}]
["Fair",50,75,65,null,"Fair",50,75,65,null,"Fair",45,70,60,null,null,null,null,null,null,null,null,null,null,null,null,null,null,null,null,null,null,null,null,null,null,null,null,null,null,null,null,"Good -",{"$f":"(AR7-AR10)/3*2+AR10","v":91.666666666666671},94.791666666666671,97.916666666666671,101.04166666666667,104.16666666666667,107.29166666666667,110.41666666666667,113.54166666666667,{"$f":"(AZ7-AZ10)/3*2+AZ10","v":116.66666666666667},3.125,null,"Good -",{"$f":"(BD7-BD10)/3*2+BD10","v":88.333333333333329},{"$f":"$BE$18*$BM8+BD8","v":92.083333333333329},95.833333333333329,99.583333333333329,103.33333333333333,107.08333333333333,110.83333333333333,114.58333333333333,{"$f":"(BL7-BL10)/3*2+BL10","v":118.33333333333333},{"$f":"(BL8-BD8)/8","v":3.75},null,"Good -",{"$f":"(BP7-BP10)/3*2+BP10","v":86.666666666666671},{"$f":"$BQ$18*$BY8+BP8","v":90},93.333333333333329,96.666666666666657,99.999999999999986,103.33333333333331,106.66666666666664,109.99999999999997,{"$f":"(BX7-BX10)/3*2+BX10","v":113.33333333333333},{"$f":"(BX8-BP8)/8","v":3.3333333333333321},null,"Good -",{"$f":"(CB7-CB10)/3*2+CB10","v":71.666666666666671},{"$f":"$CC$18*$CK8+CB8","v":75.625},79.583333333333329,83.541666666666657,87.499999999999986,91.458333333333314,95.416666666666643,99.374999999999972,{"$f":"(CJ7-CJ10)/3*2+CJ10","v":103.33333333333333},{"$f":"(CJ8-CB8)/8","v":3.9583333333333321},null,"Good -",{"$f":"(CN7-CN10)/3*2+CN10","v":35},{"$f":"$CO$18*$CW8+CN8","v":37.083333333333336},39.166666666666671,41.250000000000007,43.333333333333343,45.416666666666679,47.500000000000014,49.58333333333335,{"$f":"(CV7-CV10)/3*2+CV10","v":51.666666666666671},{"$f":"(CV8-CN8)/8","v":2.0833333333333339}]
["Low",30,50,40,null,"Low",25,50,40,null,"Low",25,45,35,null,null,null,null,null,"V Lookup Tables",null,null,null,null,null,null,null,null,null,null,null,null,null,null,null,null,null,null,null,null,null,null,"Average +",{"$f":"(AR7-AR10)/3*1+AR10","v":83.333333333333329},85.833333333333329,88.333333333333329,90.833333333333329,93.333333333333329,95.833333333333329,98.333333333333329,100.83333333333333,{"$f":"(AZ7-AZ10)/3*1+AZ10","v":103.33333333333333},2.5,null,"Average +",{"$f":"(BD7-BD10)/3*1+BD10","v":81.666666666666671},84.791666666666671,87.916666666666671,91.041666666666671,94.166666666666671,97.291666666666671,100.41666666666667,103.54166666666667,{"$f":"(BL7-BL10)/3*1+BL10","v":106.66666666666667},3.125,null,"Average +",{"$f":"(BP7-BP10)/3*1+BP10","v":78.333333333333329},81.25,84.166666666666671,87.083333333333343,90.000000000000014,92.916666666666686,95.833333333333357,98.750000000000028,{"$f":"(BX7-BX10)/3*1+BX10","v":101.66666666666667},{"$f":"(BX9-BP9)/8","v":2.9166666666666679},null,"Average +",{"$f":"(CB7-CB10)/3*1+CB10","v":63.333333333333336},66.875,70.416666666666671,73.958333333333343,77.500000000000014,81.041666666666686,84.583333333333357,88.125000000000028,{"$f":"(CJ7-CJ10)/3*1+CJ10","v":91.666666666666671},{"$f":"(CJ9-CB9)/8","v":3.541666666666667},null,"Average +",{"$f":"(CN7-CN10)/3*1+CN10","v":30},31.666666666666668,33.333333333333336,35,36.666666666666664,38.333333333333329,39.999999999999993,41.666666666666657,{"$f":"(CV7-CV10)/3*1+CV10","v":43.333333333333336},{"$f":"(CV9-CN9)/8","v":1.666666666666667}]
[null,"poor -","very good",null,null,null,"poor -","very good",null,null,null,"poor -","very good",null,null,null,null,null,null,null,null,null,null,null,null,null,null,null,null,null,null,null,null,null,null,null,null,null,null,null,null,null,"Average  ",75,76.875,78.75,80.625,82.5,84.375,86.25,88.125,90,1.875,null,"Average  ",75,77.5,80,82.5,85,87.5,90,92.5,95,2.5,null,"Average  ",70,72.5,75,77.5,80,82.5,85,87.5,90,2.5,null,"Average  ",55,58.125,61.25,64.375,67.5,70.625,73.75,76.875,80,3.125,null,"Average  ",25,26.25,27.5,28.75,30,31.25,32.5,33.75,35,1.25]
{"$rows_left_out":120}
{"sheet":"Price Tbl-2026 SalesComp","index":4,"n_rows":47,"n_cols":10,"rows_kept":47,"cut":false,"hidden":false,"merged":[[40,0,40,3],[40,5,40,9],[13,0,13,3],[13,5,13,9],[22,0,22,3],[22,5,22,9],[31,0,31,3],[31,5,31,9],[4,0,4,3],[4,5,4,9],[0,0,1,9],[2,0,2,3],[2,5,2,9],[3,0,3,3],[3,5,3,9]]}
["2026 Guide"]
[]
["Added very good category interpolation for 2026",null,null,null,null,"BOLD AMOUNTS ARE SALES (rounded)"]
["PVD Recommended Increase for 2026 guide",null,null,null,null,"COMPARISON- 17 Vendor Sales-Applied to 2025 Table Relationships"]
["Weigh and Mix/Full Batch in Mill ",null,null,null,null,"Weigh and Mix/Full Batch in Mill "]
[null,"Low","High","Midpt",null,null,"low ","high","midpt","Sale % change from 2026 recommend (high)"]
["Very Good",140,180,160,null,"Very Good",205,255,230,0.41666666666666669]
["Good",100,130,115,null,"Good",130,175,155,0.34615384615384615]
["Average",75,90,85,null,"Average",140,175,160,0.94444444444444442]
["Fair",50,75,65,null,"Fair",90,135,115,0.8]
{"$rows_left_out":37}